compileKotlin failed

Hello. When I try compile my project I have that error

Task :buildSrc:compileKotlin
The kotlin-dsl plugin applied to project ‘:buildSrc’ enables experimental Kotlin compiler features. For more information see https://docs.gradle.org/5.6/userguide/kotlin_dsl.html#sec:kotlin-dsl_plugin

Task :modules:app:compileKotlin
e: E:\prog\EpomisCloud\modules\app\src\main\kotlin\epomis\cloud\Sideloader.kt: (65, 10): Unresolved reference. None of the following candidates is applicable because of receiver type mismatch:
public inline fun Array<out ???>.takeWhile(predicate: (???) -> Boolean): List<???> defined in kotlin.collections
public inline fun BooleanArray.takeWhile(predicate: (Boolean) -> Boolean): List defined in kotlin.collections
public inline fun ByteArray.takeWhile(predicate: (Byte) -> Boolean): List defined in kotlin.collections
public inline fun CharArray.takeWhile(predicate: (Char) -> Boolean): List defined in kotlin.collections
public inline fun CharSequence.takeWhile(predicate: (Char) -> Boolean): CharSequence defined in kotlin.text
public inline fun DoubleArray.takeWhile(predicate: (Double) -> Boolean): List defined in kotlin.collections
public inline fun FloatArray.takeWhile(predicate: (Float) -> Boolean): List defined in kotlin.collections
public inline fun IntArray.takeWhile(predicate: (Int) -> Boolean): List defined in kotlin.collections
public inline fun LongArray.takeWhile(predicate: (Long) -> Boolean): List defined in kotlin.collections
public inline fun ShortArray.takeWhile(predicate: (Short) -> Boolean): List defined in kotlin.collections
public inline fun String.takeWhile(predicate: (Char) -> Boolean): String defined in kotlin.text
@SinceKotlin @ExperimentalUnsignedTypes @InlineOnly public inline fun UByteArray.takeWhile(predicate: (UByte) -> Boolean): List defined in kotlin.collections
@SinceKotlin @ExperimentalUnsignedTypes @InlineOnly public inline fun UIntArray.takeWhile(predicate: (UInt) -> Boolean): List defined in kotlin.collections
@SinceKotlin @ExperimentalUnsignedTypes @InlineOnly public inline fun ULongArray.takeWhile(predicate: (ULong) -> Boolean): List defined in kotlin.collections
@SinceKotlin @ExperimentalUnsignedTypes @InlineOnly public inline fun UShortArray.takeWhile(predicate: (UShort) -> Boolean): List defined in kotlin.collections
public inline fun Iterable<???>.takeWhile(predicate: (???) -> Boolean): List<???> defined in kotlin.collections
public fun Sequence<???>.takeWhile(predicate: (???) -> Boolean): Sequence<???> defined in kotlin.sequences
e: E:\prog\EpomisCloud\modules\app\src\main\kotlin\epomis\cloud\Sideloader.kt: (66, 32): Unresolved reference: it
e: E:\prog\EpomisCloud\modules\app\src\main\kotlin\epomis\cloud\Sideloader.kt: (67, 50): Unresolved reference: it
e: E:\prog\EpomisCloud\modules\app\src\main\kotlin\epomis\cloud\Sideloader.kt: (68, 39): Unresolved reference: it
e: E:\prog\EpomisCloud\modules\app\src\main\kotlin\epomis\cloud\spammer\RecruiterRecycle.kt: (57, 10): Unresolved reference. None of the following candidates is applicable because of receiver type mismatch:
public inline fun Array<out ???>.takeWhile(predicate: (???) -> Boolean): List<???> defined in kotlin.collections
public inline fun BooleanArray.takeWhile(predicate: (Boolean) -> Boolean): List defined in kotlin.collections
public inline fun ByteArray.takeWhile(predicate: (Byte) -> Boolean): List defined in kotlin.collections
public inline fun CharArray.takeWhile(predicate: (Char) -> Boolean): List defined in kotlin.collections
public inline fun CharSequence.takeWhile(predicate: (Char) -> Boolean): CharSequence defined in kotlin.text
public inline fun DoubleArray.takeWhile(predicate: (Double) -> Boolean): List defined in kotlin.collections
public inline fun FloatArray.takeWhile(predicate: (Float) -> Boolean): List defined in kotlin.collections
public inline fun IntArray.takeWhile(predicate: (Int) -> Boolean): List defined in kotlin.collections
public inline fun LongArray.takeWhile(predicate: (Long) -> Boolean): List defined in kotlin.collections
public inline fun ShortArray.takeWhile(predicate: (Short) -> Boolean): List defined in kotlin.collections
public inline fun String.takeWhile(predicate: (Char) -> Boolean): String defined in kotlin.text
@SinceKotlin @ExperimentalUnsignedTypes @InlineOnly public inline fun UByteArray.takeWhile(predicate: (UByte) -> Boolean): List defined in kotlin.collections
@SinceKotlin @ExperimentalUnsignedTypes @InlineOnly public inline fun UIntArray.takeWhile(predicate: (UInt) -> Boolean): List defined in kotlin.collections
@SinceKotlin @ExperimentalUnsignedTypes @InlineOnly public inline fun ULongArray.takeWhile(predicate: (ULong) -> Boolean): List defined in kotlin.collections
@SinceKotlin @ExperimentalUnsignedTypes @InlineOnly public inline fun UShortArray.takeWhile(predicate: (UShort) -> Boolean): List defined in kotlin.collections
public inline fun Iterable<???>.takeWhile(predicate: (???) -> Boolean): List<???> defined in kotlin.collections
public fun Sequence<???>.takeWhile(predicate: (???) -> Boolean): Sequence<???> defined in kotlin.sequences
e: E:\prog\EpomisCloud\modules\app\src\main\kotlin\epomis\cloud\spammer\RecruiterRecycle.kt: (58, 46): Unresolved reference: it
e: E:\prog\EpomisCloud\modules\app\src\main\kotlin\epomis\cloud\spammer\RecruiterRecycle.kt: (59, 37): Unresolved reference: it
e: E:\prog\EpomisCloud\modules\app\src\main\kotlin\epomis\cloud\spammer\RecruiterResponder.kt: (50, 10): Unresolved reference. None of the following candidates is applicable because of receiver type mismatch:
public inline fun Array<out ???>.takeWhile(predicate: (???) -> Boolean): List<???> defined in kotlin.collections
public inline fun BooleanArray.takeWhile(predicate: (Boolean) -> Boolean): List defined in kotlin.collections
public inline fun ByteArray.takeWhile(predicate: (Byte) -> Boolean): List defined in kotlin.collections
public inline fun CharArray.takeWhile(predicate: (Char) -> Boolean): List defined in kotlin.collections
public inline fun CharSequence.takeWhile(predicate: (Char) -> Boolean): CharSequence defined in kotlin.text
public inline fun DoubleArray.takeWhile(predicate: (Double) -> Boolean): List defined in kotlin.collections
public inline fun FloatArray.takeWhile(predicate: (Float) -> Boolean): List defined in kotlin.collections
public inline fun IntArray.takeWhile(predicate: (Int) -> Boolean): List defined in kotlin.collections
public inline fun LongArray.takeWhile(predicate: (Long) -> Boolean): List defined in kotlin.collections
public inline fun ShortArray.takeWhile(predicate: (Short) -> Boolean): List defined in kotlin.collections
public inline fun String.takeWhile(predicate: (Char) -> Boolean): String defined in kotlin.text
@SinceKotlin @ExperimentalUnsignedTypes @InlineOnly public inline fun UByteArray.takeWhile(predicate: (UByte) -> Boolean): List defined in kotlin.collections
@SinceKotlin @ExperimentalUnsignedTypes @InlineOnly public inline fun UIntArray.takeWhile(predicate: (UInt) -> Boolean): List defined in kotlin.collections
@SinceKotlin @ExperimentalUnsignedTypes @InlineOnly public inline fun ULongArray.takeWhile(predicate: (ULong) -> Boolean): List defined in kotlin.collections
@SinceKotlin @ExperimentalUnsignedTypes @InlineOnly public inline fun UShortArray.takeWhile(predicate: (UShort) -> Boolean): List defined in kotlin.collections
public inline fun Iterable<???>.takeWhile(predicate: (???) -> Boolean): List<???> defined in kotlin.collections
public fun Sequence<???>.takeWhile(predicate: (???) -> Boolean): Sequence<???> defined in kotlin.sequences
e: E:\prog\EpomisCloud\modules\app\src\main\kotlin\epomis\cloud\spammer\RecruiterResponder.kt: (50, 69): Unresolved reference: it
e: E:\prog\EpomisCloud\modules\app\src\main\kotlin\epomis\cloud\spammer\RecruiterResponder.kt: (51, 37): Unresolved reference: it
e: E:\prog\EpomisCloud\modules\app\src\main\kotlin\epomis\cloud\spammer\RecruiterResponder.kt: (51, 42): Unresolved reference: it
e: E:\prog\EpomisCloud\modules\app\src\main\kotlin\epomis\cloud\spammer\RecruiterResponder.kt: (52, 16): Unresolved reference: it
e: E:\prog\EpomisCloud\modules\app\src\main\kotlin\epomis\cloud\spammer\RecruiterResponder.kt: (53, 16): Cannot infer a type for this parameter. Please specify it explicitly.
e: E:\prog\EpomisCloud\modules\app\src\main\kotlin\epomis\cloud\spammer\RecruiterResponder.kt: (53, 45): Unresolved reference: it
e: E:\prog\EpomisCloud\modules\app\src\main\kotlin\epomis\cloud\spammer\RecruiterResponder.kt: (54, 41): Unresolved reference: it
e: E:\prog\EpomisCloud\modules\app\src\main\kotlin\epomis\cloud\spammer\RecruiterResponder.kt: (55, 21): Unresolved reference: it

Task :modules:app:compileKotlin FAILED

FAILURE: Build failed with an exception.

  • What went wrong:
    Execution failed for task ‘:modules:app:compileKotlin’.

Compilation error. See log for more details

  • Try:
    Run with --stacktrace option to get the stack trace. Run with --info or --debug option to get more log output. Run with --scan to get full insights.

  • Get more help at https://help.gradle.org

BUILD FAILED in 14s
2 actionable tasks: 1 executed, 1 up-to-date

I have Gradle 5.6, Kotlin 1.3.50. OpenJDK12. I don’t any underlines in the code.