Error when run tests with gradle


#1

Hi!

During tests execution via gradle I get kotlin.KotlinNullPointerException, does it a bug? Full log:
>gradle test --stacktrace
Picked up JAVA_TOOL_OPTIONS: -Dfile.encoding=UTF8
:kaptKotlin ^
:compileKotlin
:compileJava
:copyMainKotlinClasses UP-TO-DATE
:processResources UP-TO-DATE
:classes
:kaptTestKotlin
:compileTestKotlin
:compileTestJava NO-SOURCE
:copyTestKotlinClasses FAILED

FAILURE: Build failed with an exception.

* What went wrong:
Execution failed for task ':copyTestKotlinClasses'.
> kotlin.KotlinNullPointerException (no error message)

* Try:
Run with --info or --debug option to get more log output.

* Exception is:
org.gradle.api.tasks.TaskExecutionException: Execution failed for task ':copyTestKotlinClasses'.
        at org.gradle.api.internal.tasks.execution.ExecuteActionsTaskExecuter.executeActions(ExecuteActionsTaskExecuter.java:84)
        at org.gradle.api.internal.tasks.execution.ExecuteActionsTaskExecuter.execute(ExecuteActionsTaskExecuter.java:55)
        at org.gradle.api.internal.tasks.execution.SkipUpToDateTaskExecuter.execute(SkipUpToDateTaskExecuter.java:62)
        at org.gradle.api.internal.tasks.execution.ValidatingTaskExecuter.execute(ValidatingTaskExecuter.java:58)
        at org.gradle.api.internal.tasks.execution.SkipEmptySourceFilesTaskExecuter.execute(SkipEmptySourceFilesTaskExecuter.java:88)
        at org.gradle.api.internal.tasks.execution.ResolveTaskArtifactStateTaskExecuter.execute(ResolveTaskArtifactStateTaskExecuter.java:46)
        at org.gradle.api.internal.tasks.execution.SkipTaskWithNoActionsExecuter.execute(SkipTaskWithNoActionsExecuter.java:51)
        at org.gradle.api.internal.tasks.execution.SkipOnlyIfTaskExecuter.execute(SkipOnlyIfTaskExecuter.java:54)
        at org.gradle.api.internal.tasks.execution.ExecuteAtMostOnceTaskExecuter.execute(ExecuteAtMostOnceTaskExecuter.java:43)
        at org.gradle.api.internal.tasks.execution.CatchExceptionTaskExecuter.execute(CatchExceptionTaskExecuter.java:34)
        at org.gradle.execution.taskgraph.DefaultTaskGraphExecuter$EventFiringTaskWorker$1.execute(DefaultTaskGraphExecuter.java:236)
        at org.gradle.execution.taskgraph.DefaultTaskGraphExecuter$EventFiringTaskWorker$1.execute(DefaultTaskGraphExecuter.java:228)
        at org.gradle.internal.Transformers$4.transform(Transformers.java:169)
        at org.gradle.internal.progress.DefaultBuildOperationExecutor.run(DefaultBuildOperationExecutor.java:106)
        at org.gradle.internal.progress.DefaultBuildOperationExecutor.run(DefaultBuildOperationExecutor.java:61)
        at org.gradle.execution.taskgraph.DefaultTaskGraphExecuter$EventFiringTaskWorker.execute(DefaultTaskGraphExecuter.java:228)
        at org.gradle.execution.taskgraph.DefaultTaskGraphExecuter$EventFiringTaskWorker.execute(DefaultTaskGraphExecuter.java:215)
        at org.gradle.execution.taskgraph.AbstractTaskPlanExecutor$TaskExecutorWorker.processTask(AbstractTaskPlanExecutor.java:77)
        at org.gradle.execution.taskgraph.AbstractTaskPlanExecutor$TaskExecutorWorker.run(AbstractTaskPlanExecutor.java:58)
        at org.gradle.execution.taskgraph.DefaultTaskPlanExecutor.process(DefaultTaskPlanExecutor.java:32)
        at org.gradle.execution.taskgraph.DefaultTaskGraphExecuter.execute(DefaultTaskGraphExecuter.java:113)
        at org.gradle.execution.SelectedTaskExecutionAction.execute(SelectedTaskExecutionAction.java:37)
        at org.gradle.execution.DefaultBuildExecuter.execute(DefaultBuildExecuter.java:37)
        at org.gradle.execution.DefaultBuildExecuter.access$000(DefaultBuildExecuter.java:23)
        at org.gradle.execution.DefaultBuildExecuter$1.proceed(DefaultBuildExecuter.java:43)
        at org.gradle.execution.DryRunBuildExecutionAction.execute(DryRunBuildExecutionAction.java:32)
        at org.gradle.execution.DefaultBuildExecuter.execute(DefaultBuildExecuter.java:37)
        at org.gradle.execution.DefaultBuildExecuter.execute(DefaultBuildExecuter.java:30)
        at org.gradle.initialization.DefaultGradleLauncher$RunTasksAction.execute(DefaultGradleLauncher.java:256)
        at org.gradle.initialization.DefaultGradleLauncher$RunTasksAction.execute(DefaultGradleLauncher.java:253)
        at org.gradle.internal.Transformers$4.transform(Transformers.java:169)
        at org.gradle.internal.progress.DefaultBuildOperationExecutor.run(DefaultBuildOperationExecutor.java:106)
        at org.gradle.internal.progress.DefaultBuildOperationExecutor.run(DefaultBuildOperationExecutor.java:56)
        at org.gradle.initialization.DefaultGradleLauncher.doBuildStages(DefaultGradleLauncher.java:175)
        at org.gradle.initialization.DefaultGradleLauncher.doBuild(DefaultGradleLauncher.java:119)
        at org.gradle.initialization.DefaultGradleLauncher.run(DefaultGradleLauncher.java:102)
        at org.gradle.launcher.exec.GradleBuildController.run(GradleBuildController.java:71)
        at org.gradle.tooling.internal.provider.ExecuteBuildActionRunner.run(ExecuteBuildActionRunner.java:28)
        at org.gradle.launcher.exec.ChainingBuildActionRunner.run(ChainingBuildActionRunner.java:35)
        at org.gradle.launcher.exec.InProcessBuildActionExecuter.execute(InProcessBuildActionExecuter.java:41)
        at org.gradle.launcher.exec.InProcessBuildActionExecuter.execute(InProcessBuildActionExecuter.java:26)
        at org.gradle.tooling.internal.provider.ContinuousBuildActionExecuter.execute(ContinuousBuildActionExecuter.java:75)
        at org.gradle.tooling.internal.provider.ContinuousBuildActionExecuter.execute(ContinuousBuildActionExecuter.java:49)
        at org.gradle.tooling.internal.provider.ServicesSetupBuildActionExecuter.execute(ServicesSetupBuildActionExecuter.java:49)
        at org.gradle.tooling.internal.provider.ServicesSetupBuildActionExecuter.execute(ServicesSetupBuildActionExecuter.java:31)
        at org.gradle.launcher.daemon.server.exec.ExecuteBuild.doBuild(ExecuteBuild.java:67)
        at org.gradle.launcher.daemon.server.exec.BuildCommandOnly.execute(BuildCommandOnly.java:36)
        at org.gradle.launcher.daemon.server.api.DaemonCommandExecution.proceed(DaemonCommandExecution.java:120)
        at org.gradle.launcher.daemon.server.exec.WatchForDisconnection.execute(WatchForDisconnection.java:47)
        at org.gradle.launcher.daemon.server.api.DaemonCommandExecution.proceed(DaemonCommandExecution.java:120)
        at org.gradle.launcher.daemon.server.exec.ResetDeprecationLogger.execute(ResetDeprecationLogger.java:26)
        at org.gradle.launcher.daemon.server.api.DaemonCommandExecution.proceed(DaemonCommandExecution.java:120)
        at org.gradle.launcher.daemon.server.exec.RequestStopIfSingleUsedDaemon.execute(RequestStopIfSingleUsedDaemon.java:34)
        at org.gradle.launcher.daemon.server.api.DaemonCommandExecution.proceed(DaemonCommandExecution.java:120)
        at org.gradle.launcher.daemon.server.exec.ForwardClientInput$2.call(ForwardClientInput.java:74)
        at org.gradle.launcher.daemon.server.exec.ForwardClientInput$2.call(ForwardClientInput.java:72)
        at org.gradle.util.Swapper.swap(Swapper.java:38)
        at org.gradle.launcher.daemon.server.exec.ForwardClientInput.execute(ForwardClientInput.java:72)
        at org.gradle.launcher.daemon.server.api.DaemonCommandExecution.proceed(DaemonCommandExecution.java:120)
        at org.gradle.launcher.daemon.server.exec.LogAndCheckHealth.execute(LogAndCheckHealth.java:55)
        at org.gradle.launcher.daemon.server.api.DaemonCommandExecution.proceed(DaemonCommandExecution.java:120)
        at org.gradle.launcher.daemon.server.exec.LogToClient.doBuild(LogToClient.java:60)
        at org.gradle.launcher.daemon.server.exec.BuildCommandOnly.execute(BuildCommandOnly.java:36)
        at org.gradle.launcher.daemon.server.api.DaemonCommandExecution.proceed(DaemonCommandExecution.java:120)
        at org.gradle.launcher.daemon.server.exec.EstablishBuildEnvironment.doBuild(EstablishBuildEnvironment.java:72)
        at org.gradle.launcher.daemon.server.exec.BuildCommandOnly.execute(BuildCommandOnly.java:36)
        at org.gradle.launcher.daemon.server.api.DaemonCommandExecution.proceed(DaemonCommandExecution.java:120)
        at org.gradle.launcher.daemon.server.exec.StartBuildOrRespondWithBusy$1.run(StartBuildOrRespondWithBusy.java:50)
        at org.gradle.launcher.daemon.server.DaemonStateCoordinator$1.run(DaemonStateCoordinator.java:297)
        at org.gradle.internal.concurrent.ExecutorPolicy$CatchAndRecordFailures.onExecute(ExecutorPolicy.java:63)
        at org.gradle.internal.concurrent.StoppableExecutorImpl$1.run(StoppableExecutorImpl.java:46)
Caused by: kotlin.KotlinNullPointerException
        at org.jetbrains.kotlin.gradle.tasks.SyncOutputTask.siblingInJavaDir(SyncOutputTask.kt:162)
        at org.jetbrains.kotlin.gradle.tasks.SyncOutputTask.siblingInJavaDir$default(SyncOutputTask.kt:161)
        at org.jetbrains.kotlin.gradle.tasks.SyncOutputTask.processIncrementally(SyncOutputTask.kt:125)
        at org.jetbrains.kotlin.gradle.tasks.SyncOutputTask.access$processIncrementally(SyncOutputTask.kt:57)
        at org.jetbrains.kotlin.gradle.tasks.SyncOutputTask$execute$2.execute(SyncOutputTask.kt:93)
        at org.jetbrains.kotlin.gradle.tasks.SyncOutputTask$execute$2.execute(SyncOutputTask.kt:57)
        at org.gradle.api.internal.changedetection.changes.ChangesOnlyIncrementalTaskInputs.doOutOfDate(ChangesOnlyIncrementalTaskInputs.java:46)
        at org.gradle.api.internal.changedetection.changes.StatefulIncrementalTaskInputs.outOfDate(StatefulIncrementalTaskInputs.java:39)
        at org.gradle.api.internal.changedetection.changes.ChangesOnlyIncrementalTaskInputs.outOfDate(ChangesOnlyIncrementalTaskInputs.java:27)
        at org.jetbrains.kotlin.gradle.tasks.SyncOutputTask.execute(SyncOutputTask.kt:93)
        at org.gradle.internal.reflect.JavaMethod.invoke(JavaMethod.java:73)
        at org.gradle.api.internal.project.taskfactory.DefaultTaskClassInfoStore$IncrementalTaskAction.doExecute(DefaultTaskClassInfoStore.java:163)
        at org.gradle.api.internal.project.taskfactory.DefaultTaskClassInfoStore$StandardTaskAction.execute(DefaultTaskClassInfoStore.java:134)
        at org.gradle.api.internal.project.taskfactory.DefaultTaskClassInfoStore$StandardTaskAction.execute(DefaultTaskClassInfoStore.java:123)
        at org.gradle.api.internal.tasks.execution.ExecuteActionsTaskExecuter.executeAction(ExecuteActionsTaskExecuter.java:95)
        at org.gradle.api.internal.tasks.execution.ExecuteActionsTaskExecuter.executeActions(ExecuteActionsTaskExecuter.java:76)
        ... 70 more

build.gradle:

group 'test'
version '0.1.0-SNAPSHOT'

buildscript {
    ext.kotlin_version = '1.1.0'
    ext.boot_ver = '1.5.2.RELEASE'
    repositories {
        mavenCentral()
        maven {
            url "https://plugins.gradle.org/m2/"
        }
    }
    dependencies {
        classpath "org.springframework.boot:spring-boot-gradle-plugin:$boot_ver"
        classpath "org.jetbrains.kotlin:kotlin-gradle-plugin:$kotlin_version"
        classpath "org.jetbrains.kotlin:kotlin-noarg:$kotlin_version"
        classpath "org.jetbrains.kotlin:kotlin-allopen:$kotlin_version"
    }
}

apply plugin: 'java'
apply plugin: 'kotlin'
apply plugin: 'kotlin-spring'
apply plugin: 'kotlin-allopen'
//apply plugin: 'kotlin-noarg' // add default no-arg constructor
apply plugin: 'kotlin-jpa'
apply plugin: 'kotlin-kapt'
apply plugin: 'org.springframework.boot'
sourceCompatibility = 1.8


compileKotlin {
    kotlinOptions {
        jvmTarget = "1.8"
    }
}

repositories {
    mavenCentral()
    jcenter()
}

dependencies {
    compile "org.jetbrains.kotlin:kotlin-stdlib-jre8:$kotlin_version"
    compile "org.jetbrains.kotlin:kotlin-reflect:$kotlin_version"
    compile "com.fasterxml.jackson.module:jackson-module-kotlin"
    compile "com.fasterxml.jackson.datatype:jackson-datatype-jsr310"
    compile "org.springframework.boot:spring-boot-starter-web"
    compile "org.springframework.boot:spring-boot-starter-data-jpa"
    compile 'org.flywaydb:flyway-core'
    compile 'com.h2database:h2'
    compile 'org.projectlombok:lombok:1.16.14'
    compile 'org.mapstruct:mapstruct-jdk8:1.1.0.Final'
    kapt 'org.mapstruct:mapstruct-processor:1.1.0.Final'
//    compile project(":ui")
    testCompile "org.springframework.boot:spring-boot-starter-test"
    testCompile 'junit:junit'
}

#2

same bug as https://youtrack.jetbrains.com/issue/KT-16829

clean project help for me