Gradle 2.12 support for kotlin-gradle-plugin?


#1

It seems like the kotlin-gradle-plugin doesn’t support Gradle 2.12 (2.11 works fine)

I am using version 1.0.0 of kotlin and kotlin-gradle-plugin

It seems like KotlinSourceSetImpl tries to use a constructor that doesn’t exist anymore:

java.lang.NoSuchMethodError: org.gradle.api.internal.file.DefaultSourceDirectorySet.<init>(Ljava/lang/String;Lorg/gradle/api/internal/file/FileResolver;)V

Here is the call stack:

10:59:16.913 [ERROR] [org.gradle.BuildExceptionReporter] * What went wrong:
10:59:16.913 [ERROR] [org.gradle.BuildExceptionReporter] A problem occurred evaluating script.
10:59:16.913 [ERROR] [org.gradle.BuildExceptionReporter] > org.gradle.api.internal.file.DefaultSourceDirectorySet.<init>(Ljava/lang/String;Lorg/gradle/api/internal/file/FileResolver;)V
10:59:16.913 [ERROR] [org.gradle.BuildExceptionReporter]
10:59:16.913 [ERROR] [org.gradle.BuildExceptionReporter] * Exception is:
10:59:16.913 [ERROR] [org.gradle.BuildExceptionReporter] org.gradle.api.GradleScriptException: A problem occurred evaluating script.
10:59:16.913 [ERROR] [org.gradle.BuildExceptionReporter] 	at org.gradle.groovy.scripts.internal.DefaultScriptRunnerFactory$ScriptRunnerImpl.run(DefaultScriptRunnerFactory.java:93)
10:59:16.914 [ERROR] [org.gradle.BuildExceptionReporter] 	at org.gradle.configuration.DefaultScriptPluginFactory$ScriptPluginImpl$2.run(DefaultScriptPluginFactory.java:155)
10:59:16.914 [ERROR] [org.gradle.BuildExceptionReporter] 	at org.gradle.configuration.DefaultScriptTarget.addConfiguration(DefaultScriptTarget.java:69)
10:59:16.914 [ERROR] [org.gradle.BuildExceptionReporter] 	at org.gradle.configuration.DefaultScriptPluginFactory$ScriptPluginImpl.apply(DefaultScriptPluginFactory.java:160)
10:59:16.914 [ERROR] [org.gradle.BuildExceptionReporter] 	at org.gradle.api.internal.plugins.DefaultObjectConfigurationAction.applyScript(DefaultObjectConfigurationAction.java:101)
10:59:16.914 [ERROR] [org.gradle.BuildExceptionReporter] 	at org.gradle.api.internal.plugins.DefaultObjectConfigurationAction.access$000(DefaultObjectConfigurationAction.java:35)
10:59:16.914 [ERROR] [org.gradle.BuildExceptionReporter] 	at org.gradle.api.internal.plugins.DefaultObjectConfigurationAction$1.run(DefaultObjectConfigurationAction.java:61)
10:59:16.914 [ERROR] [org.gradle.BuildExceptionReporter] 	at org.gradle.api.internal.plugins.DefaultObjectConfigurationAction.execute(DefaultObjectConfigurationAction.java:135)
10:59:16.914 [ERROR] [org.gradle.BuildExceptionReporter] 	at org.gradle.groovy.scripts.DefaultScript.apply(DefaultScript.java:111)
10:59:16.914 [ERROR] [org.gradle.BuildExceptionReporter] 	at org.gradle.api.Script$apply$0.callCurrent(Unknown Source)
10:59:16.914 [ERROR] [org.gradle.BuildExceptionReporter] 	at java_app_f4alpfc1ne55fg1o1m5uwqz8b.run(/redacted/)
10:59:16.915 [ERROR] [org.gradle.BuildExceptionReporter] 	at org.gradle.groovy.scripts.internal.DefaultScriptRunnerFactory$ScriptRunnerImpl.run(DefaultScriptRunnerFactory.java:91)
10:59:16.915 [ERROR] [org.gradle.BuildExceptionReporter] 	at org.gradle.configuration.DefaultScriptPluginFactory$ScriptPluginImpl$2.run(DefaultScriptPluginFactory.java:155)
10:59:16.915 [ERROR] [org.gradle.BuildExceptionReporter] 	at org.gradle.configuration.DefaultScriptTarget.addConfiguration(DefaultScriptTarget.java:69)
10:59:16.915 [ERROR] [org.gradle.BuildExceptionReporter] 	at org.gradle.configuration.DefaultScriptPluginFactory$ScriptPluginImpl.apply(DefaultScriptPluginFactory.java:160)
10:59:16.915 [ERROR] [org.gradle.BuildExceptionReporter] 	at org.gradle.api.internal.plugins.DefaultObjectConfigurationAction.applyScript(DefaultObjectConfigurationAction.java:101)
10:59:16.915 [ERROR] [org.gradle.BuildExceptionReporter] 	at org.gradle.api.internal.plugins.DefaultObjectConfigurationAction.access$000(DefaultObjectConfigurationAction.java:35)
10:59:16.915 [ERROR] [org.gradle.BuildExceptionReporter] 	at org.gradle.api.internal.plugins.DefaultObjectConfigurationAction$1.run(DefaultObjectConfigurationAction.java:61)
10:59:16.915 [ERROR] [org.gradle.BuildExceptionReporter] 	at org.gradle.api.internal.plugins.DefaultObjectConfigurationAction.execute(DefaultObjectConfigurationAction.java:135)
10:59:16.915 [ERROR] [org.gradle.BuildExceptionReporter] 	at org.gradle.groovy.scripts.DefaultScript.apply(DefaultScript.java:111)
10:59:16.916 [ERROR] [org.gradle.BuildExceptionReporter] 	at org.gradle.api.Script$apply$0.callCurrent(Unknown Source)
10:59:16.916 [ERROR] [org.gradle.BuildExceptionReporter] 	at java_rest_app_6u0i63zvavalmvz7nwcabuiz8.run(/redacted/)
10:59:16.916 [ERROR] [org.gradle.BuildExceptionReporter] 	at org.gradle.groovy.scripts.internal.DefaultScriptRunnerFactory$ScriptRunnerImpl.run(DefaultScriptRunnerFactory.java:91)
10:59:16.916 [ERROR] [org.gradle.BuildExceptionReporter] 	at org.gradle.configuration.DefaultScriptPluginFactory$ScriptPluginImpl$2.run(DefaultScriptPluginFactory.java:155)
10:59:16.917 [ERROR] [org.gradle.BuildExceptionReporter] 	at org.gradle.configuration.DefaultScriptTarget.addConfiguration(DefaultScriptTarget.java:69)
10:59:16.917 [ERROR] [org.gradle.BuildExceptionReporter] 	at org.gradle.configuration.DefaultScriptPluginFactory$ScriptPluginImpl.apply(DefaultScriptPluginFactory.java:160)
10:59:16.917 [ERROR] [org.gradle.BuildExceptionReporter] 	at org.gradle.api.internal.plugins.DefaultObjectConfigurationAction.applyScript(DefaultObjectConfigurationAction.java:101)
10:59:16.917 [ERROR] [org.gradle.BuildExceptionReporter] 	at org.gradle.api.internal.plugins.DefaultObjectConfigurationAction.access$000(DefaultObjectConfigurationAction.java:35)
10:59:16.917 [ERROR] [org.gradle.BuildExceptionReporter] 	at org.gradle.api.internal.plugins.DefaultObjectConfigurationAction$1.run(DefaultObjectConfigurationAction.java:61)
10:59:16.917 [ERROR] [org.gradle.BuildExceptionReporter] 	at org.gradle.api.internal.plugins.DefaultObjectConfigurationAction.execute(DefaultObjectConfigurationAction.java:135)
10:59:16.917 [ERROR] [org.gradle.BuildExceptionReporter] 	at org.gradle.api.internal.project.AbstractPluginAware.apply(AbstractPluginAware.java:46)
10:59:16.918 [ERROR] [org.gradle.BuildExceptionReporter] 	at org.gradle.api.plugins.PluginAware$apply.call(Unknown Source)
10:59:16.918 [ERROR] [org.gradle.BuildExceptionReporter] 	at org.gradle.api.internal.project.ProjectScript.apply(ProjectScript.groovy:35)
10:59:16.918 [ERROR] [org.gradle.BuildExceptionReporter] 	at org.gradle.api.Script$apply$0.callCurrent(Unknown Source)
10:59:16.918 [ERROR] [org.gradle.BuildExceptionReporter] 	at build_7p1p2eyzuulhuxa10wkujtrjd.run(/redacted/)
10:59:16.918 [ERROR] [org.gradle.BuildExceptionReporter] 	at org.gradle.groovy.scripts.internal.DefaultScriptRunnerFactory$ScriptRunnerImpl.run(DefaultScriptRunnerFactory.java:91)
10:59:16.918 [ERROR] [org.gradle.BuildExceptionReporter] 	at org.gradle.configuration.DefaultScriptPluginFactory$ScriptPluginImpl$2.run(DefaultScriptPluginFactory.java:155)
10:59:16.918 [ERROR] [org.gradle.BuildExceptionReporter] 	at org.gradle.configuration.ProjectScriptTarget.addConfiguration(ProjectScriptTarget.java:72)
10:59:16.918 [ERROR] [org.gradle.BuildExceptionReporter] 	at org.gradle.configuration.DefaultScriptPluginFactory$ScriptPluginImpl.apply(DefaultScriptPluginFactory.java:160)
10:59:16.918 [ERROR] [org.gradle.BuildExceptionReporter] 	at org.gradle.configuration.project.BuildScriptProcessor.execute(BuildScriptProcessor.java:38)
10:59:16.919 [ERROR] [org.gradle.BuildExceptionReporter] 	at org.gradle.configuration.project.BuildScriptProcessor.execute(BuildScriptProcessor.java:25)
10:59:16.919 [ERROR] [org.gradle.BuildExceptionReporter] 	at org.gradle.configuration.project.ConfigureActionsProjectEvaluator.evaluate(ConfigureActionsProjectEvaluator.java:34)
10:59:16.919 [ERROR] [org.gradle.BuildExceptionReporter] 	at org.gradle.configuration.project.LifecycleProjectEvaluator.evaluate(LifecycleProjectEvaluator.java:55)
10:59:16.919 [ERROR] [org.gradle.BuildExceptionReporter] 	at org.gradle.api.internal.project.AbstractProject.evaluate(AbstractProject.java:532)
10:59:16.919 [ERROR] [org.gradle.BuildExceptionReporter] 	at org.gradle.api.internal.project.AbstractProject.evaluate(AbstractProject.java:93)
10:59:16.919 [ERROR] [org.gradle.BuildExceptionReporter] 	at org.gradle.execution.TaskPathProjectEvaluator.configureHierarchy(TaskPathProjectEvaluator.java:42)
10:59:16.920 [ERROR] [org.gradle.BuildExceptionReporter] 	at org.gradle.configuration.DefaultBuildConfigurer.configure(DefaultBuildConfigurer.java:35)
10:59:16.920 [ERROR] [org.gradle.BuildExceptionReporter] 	at org.gradle.initialization.DefaultGradleLauncher$2.run(DefaultGradleLauncher.java:125)
10:59:16.920 [ERROR] [org.gradle.BuildExceptionReporter] 	at org.gradle.internal.Factories$1.create(Factories.java:22)
10:59:16.921 [ERROR] [org.gradle.BuildExceptionReporter] 	at org.gradle.internal.progress.DefaultBuildOperationExecutor.run(DefaultBuildOperationExecutor.java:90)
10:59:16.922 [ERROR] [org.gradle.BuildExceptionReporter] 	at org.gradle.internal.progress.DefaultBuildOperationExecutor.run(DefaultBuildOperationExecutor.java:52)
10:59:16.922 [ERROR] [org.gradle.BuildExceptionReporter] 	at org.gradle.initialization.DefaultGradleLauncher.doBuildStages(DefaultGradleLauncher.java:122)
10:59:16.923 [ERROR] [org.gradle.BuildExceptionReporter] 	at org.gradle.initialization.DefaultGradleLauncher.access$200(DefaultGradleLauncher.java:32)
10:59:16.923 [ERROR] [org.gradle.BuildExceptionReporter] 	at org.gradle.initialization.DefaultGradleLauncher$1.create(DefaultGradleLauncher.java:99)
10:59:16.923 [ERROR] [org.gradle.BuildExceptionReporter] 	at org.gradle.initialization.DefaultGradleLauncher$1.create(DefaultGradleLauncher.java:93)
10:59:16.923 [ERROR] [org.gradle.BuildExceptionReporter] 	at org.gradle.internal.progress.DefaultBuildOperationExecutor.run(DefaultBuildOperationExecutor.java:90)
10:59:16.923 [ERROR] [org.gradle.BuildExceptionReporter] 	at org.gradle.internal.progress.DefaultBuildOperationExecutor.run(DefaultBuildOperationExecutor.java:62)
10:59:16.923 [ERROR] [org.gradle.BuildExceptionReporter] 	at org.gradle.initialization.DefaultGradleLauncher.doBuild(DefaultGradleLauncher.java:93)
10:59:16.923 [ERROR] [org.gradle.BuildExceptionReporter] 	at org.gradle.initialization.DefaultGradleLauncher.run(DefaultGradleLauncher.java:82)
10:59:16.923 [ERROR] [org.gradle.BuildExceptionReporter] 	at org.gradle.launcher.exec.InProcessBuildActionExecuter$DefaultBuildController.run(InProcessBuildActionExecuter.java:94)
10:59:16.923 [ERROR] [org.gradle.BuildExceptionReporter] 	at org.gradle.tooling.internal.provider.ExecuteBuildActionRunner.run(ExecuteBuildActionRunner.java:28)
10:59:16.924 [ERROR] [org.gradle.BuildExceptionReporter] 	at org.gradle.launcher.exec.ChainingBuildActionRunner.run(ChainingBuildActionRunner.java:35)
10:59:16.925 [ERROR] [org.gradle.BuildExceptionReporter] 	at org.gradle.launcher.exec.InProcessBuildActionExecuter.execute(InProcessBuildActionExecuter.java:43)
10:59:16.925 [ERROR] [org.gradle.BuildExceptionReporter] 	at org.gradle.launcher.exec.InProcessBuildActionExecuter.execute(InProcessBuildActionExecuter.java:28)
10:59:16.926 [ERROR] [org.gradle.BuildExceptionReporter] 	at org.gradle.launcher.exec.ContinuousBuildActionExecuter.execute(ContinuousBuildActionExecuter.java:75)
10:59:16.926 [ERROR] [org.gradle.BuildExceptionReporter] 	at org.gradle.launcher.exec.ContinuousBuildActionExecuter.execute(ContinuousBuildActionExecuter.java:45)
10:59:16.926 [ERROR] [org.gradle.BuildExceptionReporter] 	at org.gradle.launcher.daemon.server.exec.ExecuteBuild.doBuild(ExecuteBuild.java:52)
10:59:16.926 [ERROR] [org.gradle.BuildExceptionReporter] 	at org.gradle.launcher.daemon.server.exec.BuildCommandOnly.execute(BuildCommandOnly.java:36)
10:59:16.927 [ERROR] [org.gradle.BuildExceptionReporter] 	at org.gradle.launcher.daemon.server.api.DaemonCommandExecution.proceed(DaemonCommandExecution.java:120)
10:59:16.927 [ERROR] [org.gradle.BuildExceptionReporter] 	at org.gradle.launcher.daemon.server.exec.WatchForDisconnection.execute(WatchForDisconnection.java:37)
10:59:16.927 [ERROR] [org.gradle.BuildExceptionReporter] 	at org.gradle.launcher.daemon.server.api.DaemonCommandExecution.proceed(DaemonCommandExecution.java:120)
10:59:16.927 [ERROR] [org.gradle.BuildExceptionReporter] 	at org.gradle.launcher.daemon.server.exec.ResetDeprecationLogger.execute(ResetDeprecationLogger.java:26)
10:59:16.927 [ERROR] [org.gradle.BuildExceptionReporter] 	at org.gradle.launcher.daemon.server.api.DaemonCommandExecution.proceed(DaemonCommandExecution.java:120)
10:59:16.928 [ERROR] [org.gradle.BuildExceptionReporter] 	at org.gradle.launcher.daemon.server.exec.RequestStopIfSingleUsedDaemon.execute(RequestStopIfSingleUsedDaemon.java:34)
10:59:16.928 [ERROR] [org.gradle.BuildExceptionReporter] 	at org.gradle.launcher.daemon.server.api.DaemonCommandExecution.proceed(DaemonCommandExecution.java:120)
10:59:16.928 [ERROR] [org.gradle.BuildExceptionReporter] 	at org.gradle.launcher.daemon.server.exec.ForwardClientInput$2.call(ForwardClientInput.java:74)
10:59:16.928 [ERROR] [org.gradle.BuildExceptionReporter] 	at org.gradle.launcher.daemon.server.exec.ForwardClientInput$2.call(ForwardClientInput.java:72)
10:59:16.928 [ERROR] [org.gradle.BuildExceptionReporter] 	at org.gradle.util.Swapper.swap(Swapper.java:38)
10:59:16.928 [ERROR] [org.gradle.BuildExceptionReporter] 	at org.gradle.launcher.daemon.server.exec.ForwardClientInput.execute(ForwardClientInput.java:72)
10:59:16.928 [ERROR] [org.gradle.BuildExceptionReporter] 	at org.gradle.launcher.daemon.server.api.DaemonCommandExecution.proceed(DaemonCommandExecution.java:120)
10:59:16.928 [ERROR] [org.gradle.BuildExceptionReporter] 	at org.gradle.launcher.daemon.server.health.DaemonHealthTracker.execute(DaemonHealthTracker.java:47)
10:59:16.929 [ERROR] [org.gradle.BuildExceptionReporter] 	at org.gradle.launcher.daemon.server.api.DaemonCommandExecution.proceed(DaemonCommandExecution.java:120)
10:59:16.929 [ERROR] [org.gradle.BuildExceptionReporter] 	at org.gradle.launcher.daemon.server.exec.LogToClient.doBuild(LogToClient.java:66)
10:59:16.929 [ERROR] [org.gradle.BuildExceptionReporter] 	at org.gradle.launcher.daemon.server.exec.BuildCommandOnly.execute(BuildCommandOnly.java:36)
10:59:16.930 [ERROR] [org.gradle.BuildExceptionReporter] 	at org.gradle.launcher.daemon.server.api.DaemonCommandExecution.proceed(DaemonCommandExecution.java:120)
10:59:16.930 [ERROR] [org.gradle.BuildExceptionReporter] 	at org.gradle.launcher.daemon.server.exec.EstablishBuildEnvironment.doBuild(EstablishBuildEnvironment.java:72)
10:59:16.930 [ERROR] [org.gradle.BuildExceptionReporter] 	at org.gradle.launcher.daemon.server.exec.BuildCommandOnly.execute(BuildCommandOnly.java:36)
10:59:16.930 [ERROR] [org.gradle.BuildExceptionReporter] 	at org.gradle.launcher.daemon.server.api.DaemonCommandExecution.proceed(DaemonCommandExecution.java:120)
10:59:16.930 [ERROR] [org.gradle.BuildExceptionReporter] 	at org.gradle.launcher.daemon.server.health.HintGCAfterBuild.execute(HintGCAfterBuild.java:41)
10:59:16.930 [ERROR] [org.gradle.BuildExceptionReporter] 	at org.gradle.launcher.daemon.server.api.DaemonCommandExecution.proceed(DaemonCommandExecution.java:120)
10:59:16.930 [ERROR] [org.gradle.BuildExceptionReporter] 	at org.gradle.launcher.daemon.server.exec.StartBuildOrRespondWithBusy$1.run(StartBuildOrRespondWithBusy.java:50)
10:59:16.930 [ERROR] [org.gradle.BuildExceptionReporter] 	at org.gradle.launcher.daemon.server.DaemonStateCoordinator$1.run(DaemonStateCoordinator.java:246)
10:59:16.930 [ERROR] [org.gradle.BuildExceptionReporter] 	at org.gradle.internal.concurrent.ExecutorPolicy$CatchAndRecordFailures.onExecute(ExecutorPolicy.java:54)
10:59:16.931 [ERROR] [org.gradle.BuildExceptionReporter] 	at org.gradle.internal.concurrent.StoppableExecutorImpl$1.run(StoppableExecutorImpl.java:40)
10:59:16.931 [ERROR] [org.gradle.BuildExceptionReporter] Caused by: java.lang.NoSuchMethodError: org.gradle.api.internal.file.DefaultSourceDirectorySet.<init>(Ljava/lang/String;Lorg/gradle/api/internal/file/FileResolver;)V
10:59:16.931 [ERROR] [org.gradle.BuildExceptionReporter] 	at org.jetbrains.kotlin.gradle.internal.KotlinSourceSetImpl.<init>(KotlinSourceSet.kt:19)
10:59:16.932 [ERROR] [org.gradle.BuildExceptionReporter] 	at org.jetbrains.kotlin.gradle.plugin.KotlinSourceSetProcessor.createKotlinSourceSet(KotlinPlugin.kt:73)
10:59:16.932 [ERROR] [org.gradle.BuildExceptionReporter] 	at org.jetbrains.kotlin.gradle.plugin.KotlinSourceSetProcessor$kotlinSourceSet$2.invoke(KotlinPlugin.kt:56)
10:59:16.932 [ERROR] [org.gradle.BuildExceptionReporter] 	at org.jetbrains.kotlin.gradle.plugin.KotlinSourceSetProcessor$kotlinSourceSet$2.invoke(KotlinPlugin.kt:41)
10:59:16.932 [ERROR] [org.gradle.BuildExceptionReporter] 	at kotlin.SynchronizedLazyImpl.getValue(Lazy.kt:130)
10:59:16.932 [ERROR] [org.gradle.BuildExceptionReporter] 	at org.jetbrains.kotlin.gradle.plugin.KotlinSourceSetProcessor.getKotlinSourceSet(KotlinPlugin.kt:644)
10:59:16.932 [ERROR] [org.gradle.BuildExceptionReporter] 	at org.jetbrains.kotlin.gradle.plugin.KotlinSourceSetProcessor.run(KotlinPlugin.kt:62)
10:59:16.933 [ERROR] [org.gradle.BuildExceptionReporter] 	at org.jetbrains.kotlin.gradle.plugin.AbstractKotlinPlugin$configureSourceSetDefaults$1.execute(KotlinPlugin.kt:250)
10:59:16.933 [ERROR] [org.gradle.BuildExceptionReporter] 	at org.jetbrains.kotlin.gradle.plugin.AbstractKotlinPlugin$configureSourceSetDefaults$1.execute(KotlinPlugin.kt:233)
10:59:16.933 [ERROR] [org.gradle.BuildExceptionReporter] 	at org.gradle.api.internal.DefaultDomainObjectCollection.all(DefaultDomainObjectCollection.java:110)
10:59:16.933 [ERROR] [org.gradle.BuildExceptionReporter] 	at org.jetbrains.kotlin.gradle.plugin.AbstractKotlinPlugin.configureSourceSetDefaults(KotlinPlugin.kt:248)
10:59:16.933 [ERROR] [org.gradle.BuildExceptionReporter] 	at org.jetbrains.kotlin.gradle.plugin.AbstractKotlinPlugin.apply(KotlinPlugin.kt:242)
10:59:16.933 [ERROR] [org.gradle.BuildExceptionReporter] 	at org.jetbrains.kotlin.gradle.plugin.KotlinPlugin.apply(KotlinPlugin.kt:263)
10:59:16.934 [ERROR] [org.gradle.BuildExceptionReporter] 	at org.jetbrains.kotlin.gradle.plugin.KotlinPlugin.apply(KotlinPlugin.kt:257)
10:59:16.935 [ERROR] [org.gradle.BuildExceptionReporter] 	at org.jetbrains.kotlin.gradle.plugin.KotlinBasePluginWrapper.apply(KotlinPluginWrapper.kt:39)
10:59:16.935 [ERROR] [org.gradle.BuildExceptionReporter] 	at org.jetbrains.kotlin.gradle.plugin.KotlinBasePluginWrapper.apply(KotlinPluginWrapper.kt:20)
10:59:16.936 [ERROR] [org.gradle.BuildExceptionReporter] 	at org.gradle.api.internal.plugins.ImperativeOnlyPluginApplicator.applyImperative(ImperativeOnlyPluginApplicator.java:35)
10:59:16.937 [ERROR] [org.gradle.BuildExceptionReporter] 	at org.gradle.api.internal.plugins.RuleBasedPluginApplicator.applyImperative(RuleBasedPluginApplicator.java:43)
10:59:16.937 [ERROR] [org.gradle.BuildExceptionReporter] 	at org.gradle.api.internal.plugins.DefaultPluginManager.doApply(DefaultPluginManager.java:137)
10:59:16.937 [ERROR] [org.gradle.BuildExceptionReporter] 	at org.gradle.api.internal.plugins.DefaultPluginManager.apply(DefaultPluginManager.java:112)
10:59:16.937 [ERROR] [org.gradle.BuildExceptionReporter] 	at org.gradle.api.internal.plugins.DefaultObjectConfigurationAction.applyType(DefaultObjectConfigurationAction.java:112)
10:59:16.937 [ERROR] [org.gradle.BuildExceptionReporter] 	at org.gradle.api.internal.plugins.DefaultObjectConfigurationAction.access$200(DefaultObjectConfigurationAction.java:35)
10:59:16.937 [ERROR] [org.gradle.BuildExceptionReporter] 	at org.gradle.api.internal.plugins.DefaultObjectConfigurationAction$3.run(DefaultObjectConfigurationAction.java:79)
10:59:16.937 [ERROR] [org.gradle.BuildExceptionReporter] 	at org.gradle.api.internal.plugins.DefaultObjectConfigurationAction.execute(DefaultObjectConfigurationAction.java:135)
10:59:16.937 [ERROR] [org.gradle.BuildExceptionReporter] 	at org.gradle.groovy.scripts.DefaultScript.apply(DefaultScript.java:111)
10:59:16.937 [ERROR] [org.gradle.BuildExceptionReporter] 	at org.gradle.api.Script$apply$0.callCurrent(Unknown Source)
10:59:16.938 [ERROR] [org.gradle.BuildExceptionReporter] 	at java_7po7xs7polu1js04yroqp2oc7.run(/redacted/)
10:59:16.938 [ERROR] [org.gradle.BuildExceptionReporter] 	at org.gradle.groovy.scripts.internal.DefaultScriptRunnerFactory$ScriptRunnerImpl.run(DefaultScriptRunnerFactory.java:91)
10:59:16.938 [ERROR] [org.gradle.BuildExceptionReporter] 	... 93 more
10:59:16.938 [ERROR] [org.gradle.BuildExceptionReporter]
10:59:16.938 [LIFECYCLE] [org.gradle.BuildResultLogger]
10:59:16.939 [LIFECYCLE] [org.gradle.BuildResultLogger] BUILD FAILED

#2

We’re working on a fix for this issue right now.